[root@metalliline src]# make
make -C /lib/modules/`uname -r`/build SUBDIRS=`pwd` modules
make[1]: Entering directory `/usr/src/linux-2.6.17-5mdv'
WARNING: Symbol version dump /usr/src/linux-2.6.17-5mdv/Module.symvers
is missing; modules will have no dependencies and modversions.
CC [M] /home/rein/Desktop/uuu/scr24x_v4.2.2/scr24x_2.6.x_v4.2.2/src/scr241_main.o
In file included from /home/rein/Desktop/uuu/scr24x_v4.2.2/scr24x_2.6.x_v4.2.2/src/includes.h:114,
from /home/rein/Desktop/uuu/scr24x_v4.2.2/scr24x_2.6.x_v4.2.2/src/scr241_main.c:49:
/home/rein/Desktop/uuu/scr24x_v4.2.2/scr24x_2.6.x_v4.2.2/src/pcsc.h:234: error: expected specifier-qualifier-list before %u2018dev_link_t%u2019
/home/rein/Desktop/uuu/scr24x_v4.2.2/scr24x_2.6.x_v4.2.2/src/scr241_main.c:65: error: expected %u2018=%u2019, %u2018,%u2019, %u2018;%u2019, %u2018asm%u2019 or %u2018__attribute__%u2019 before %u2018*%u2019 token
/home/rein/Desktop/uuu/scr24x_v4.2.2/scr24x_2.6.x_v4.2.2/src/scr241_main.c:128: error: expected %u2018)%u2019 before %u2018*%u2019 token
/home/rein/Desktop/uuu/scr24x_v4.2.2/scr24x_2.6.x_v4.2.2/src/scr241_main.c: In function %u2018Driver_Attach%u2019:
/home/rein/Desktop/uuu/scr24x_v4.2.2/scr24x_2.6.x_v4.2.2/src/scr241_main.c:200: error: %u2018dev_link_t%u2019 undeclared (first use in this function)
/home/rein/Desktop/uuu/scr24x_v4.2.2/scr24x_2.6.x_v4.2.2/src/scr241_main.c:200: error: (Each undeclared identifier is reported only once
/home/rein/Desktop/uuu/scr24x_v4.2.2/scr24x_2.6.x_v4.2.2/src/scr241_main.c:200: error: for each function it appears in.)
/home/rein/Desktop/uuu/scr24x_v4.2.2/scr24x_2.6.x_v4.2.2/src/scr241_main.c:200: error: %u2018pDeviceLink%u2019 undeclared (first use in this function)
/home/rein/Desktop/uuu/scr24x_v4.2.2/scr24x_2.6.x_v4.2.2/src/scr241_main.c:201: warning: ISO C90 forbids mixed declarations and code
/home/rein/Desktop/uuu/scr24x_v4.2.2/scr24x_2.6.x_v4.2.2/src/scr241_main.c:212: error: expected expression before %u2018)%u2019 token
/home/rein/Desktop/uuu/scr24x_v4.2.2/scr24x_2.6.x_v4.2.2/src/scr241_main.c:220: error: %u2018DEVICE_EXTENSION%u2019 has no member named %u2018pucDeviceName%u2019
*lõige*
/home/rein/Desktop/uuu/scr24x_v4.2.2/scr24x_2.6.x_v4.2.2/src/scr241_main.c
/home/rein/Desktop/uuu/scr24x_v4.2.2/scr24x_2.6.x_v4.2.2/src/scr241_main.c
/home/rein/Desktop/uuu/scr24x_v4.2.2/scr24x_2.6.x_v4.2.2/src/scr241_main.c: In function %u2018PcdmCardStatusThread%u2019:
/home/rein/Desktop/uuu/scr24x_v4.2.2/scr24x_2.6.x_v4.2.2/src/scr241_main.c
/home/rein/Desktop/uuu/scr24x_v4.2.2/scr24x_2.6.x_v4.2.2/src/scr241_main.c
/home/rein/Desktop/uuu/scr24x_v4.2.2/scr24x_2.6.x_v4.2.2/src/scr241_main.c
/home/rein/Desktop/uuu/scr24x_v4.2.2/scr24x_2.6.x_v4.2.2/src/scr241_main.c
/home/rein/Desktop/uuu/scr24x_v4.2.2/scr24x_2.6.x_v4.2.2/src/scr241_main.c
make[2]: *** [/home/rein/Desktop/uuu/scr24x_v4.2.2/scr24x_2.6.x_v4.2.2/src/scr241_main.o] Error 1
make[1]: *** [_module_/home/rein/Desktop/uuu/scr24x_v4.2.2/scr24x_2.6.x_v4.2.2/src] Error 2
make[1]: Leaving directory `/usr/src/linux-2.6.17-5mdv'
make: *** [default] Error 2
[root@metalliline src]#
Kernel source stripped on paigaldatud, kas sellest ei aita?
Kernel source on üle 200 mega lihtsalt






