Google kalendri integreerimine töölauale, vajaks veidi abi
Postitatud: 03.10.2015, 07:35
Üritan järgmise õpetuse järgi paigaldada töölauale kalendrit http://xmodulo.com/integrate-google-cal ... sktop.html
Olen oma tegemistega jõudnud sinna maani kus tuleb käivitada autoriseerimine käsuga gcalcli agenda
järgmiselt lingilt on näha minu tegevus ja veateade terminali väljundis
Kellel on kogemust antud asjaga või oskab muud moodi minda aidata või nõu anda siis ootan abi 
Olen oma tegemistega jõudnud sinna maani kus tuleb käivitada autoriseerimine käsuga gcalcli agenda
järgmiselt lingilt on näha minu tegevus ja veateade terminali väljundis
Kood: Vali kõik
iffi@R400:~$ sudo apt-get install git python-pip python-gdata python-dateutil python-gflags python-vobject python-parsedatetime
[sudo] password for iffi:
Reading package lists... Done
Building dependency tree
Reading state information... Done
The following packages were automatically installed and are no longer required:
linux-headers-3.19.0-25 linux-headers-3.19.0-25-generic
linux-image-3.19.0-25-generic linux-image-extra-3.19.0-25-generic
Use 'apt-get autoremove' to remove them.
Paigaldatakse järgnevad lisapaketid:
binutils build-essential dpkg-dev fakeroot g++ g++-4.8 gcc gcc-4.8 git-man
libalgorithm-diff-perl libalgorithm-diff-xs-perl libalgorithm-merge-perl
libasan0 libatomic1 libc-dev-bin libc6-dev libdpkg-perl liberror-perl
libfakeroot libfile-fcntllock-perl libgcc-4.8-dev libitm1 libstdc++-4.8-dev
linux-libc-dev make manpages-dev python-chardet-whl python-colorama
python-colorama-whl python-crypto python-distlib python-distlib-whl
python-html5lib python-html5lib-whl python-pip-whl python-pyicu
python-requests-whl python-setuptools python-setuptools-whl python-six-whl
python-urllib3-whl python-wheel
Soovituslikud paketid:
binutils-doc debian-keyring g++-multilib g++-4.8-multilib gcc-4.8-doc
libstdc++6-4.8-dbg gcc-multilib autoconf automake1.9 libtool flex bison gdb
gcc-doc gcc-4.8-multilib gcc-4.8-locales libgcc1-dbg libgomp1-dbg
libitm1-dbg libatomic1-dbg libasan0-dbg libtsan0-dbg libquadmath0-dbg
git-daemon-run git-daemon-sysvinit git-doc git-el git-email git-gui gitk
gitweb git-arch git-bzr git-cvs git-mediawiki git-svn glibc-doc
libstdc++-4.8-doc make-doc python-crypto-dbg python-crypto-doc
python-gdata-doc python-genshi
Soovitatavad paketid:
python-dev-all
Paigaldatakse järgnevad UUED paketid:
binutils build-essential dpkg-dev fakeroot g++ g++-4.8 gcc gcc-4.8 git
git-man libalgorithm-diff-perl libalgorithm-diff-xs-perl
libalgorithm-merge-perl libasan0 libatomic1 libc-dev-bin libc6-dev
libdpkg-perl liberror-perl libfakeroot libfile-fcntllock-perl libgcc-4.8-dev
libitm1 libstdc++-4.8-dev linux-libc-dev make manpages-dev
python-chardet-whl python-colorama python-colorama-whl python-crypto
python-dateutil python-distlib python-distlib-whl python-gdata python-gflags
python-html5lib python-html5lib-whl python-parsedatetime python-pip
python-pip-whl python-pyicu python-requests-whl python-setuptools
python-setuptools-whl python-six-whl python-urllib3-whl python-vobject
python-wheel
0 uuendatud, 49 värskelt paigaldatud, 0 eemaldada ja 2 uuendamata.
On vaja tõmmata 35,9 MB arhiive.
Selle tegevuse tulemusel kasutatakse 118 MB lisa kettaruumi.
Do you want to continue? [Y/n] y
Tõmba:1 http://ee.archive.ubuntu.com/ubuntu/ trusty-updates/main libasan0 i386 4.8.4-2ubuntu1~14.04 [64,1 kB]
Tõmba:2 http://ee.archive.ubuntu.com/ubuntu/ trusty-updates/main libatomic1 i386 4.8.4-2ubuntu1~14.04 [8 276 B]
Tõmba:3 http://ee.archive.ubuntu.com/ubuntu/ trusty-updates/main libitm1 i386 4.8.4-2ubuntu1~14.04 [28,5 kB]
Tõmba:4 http://ee.archive.ubuntu.com/ubuntu/ trusty-updates/main binutils i386 2.24-5ubuntu14 [2 118 kB]
Tõmba:5 http://ee.archive.ubuntu.com/ubuntu/ trusty-updates/main libc-dev-bin i386 2.19-0ubuntu6.6 [63,4 kB]
Tõmba:6 http://ee.archive.ubuntu.com/ubuntu/ trusty-updates/main linux-libc-dev i386 3.13.0-65.105 [776 kB]
Tõmba:7 http://ee.archive.ubuntu.com/ubuntu/ trusty-updates/main libc6-dev i386 2.19-0ubuntu6.6 [1 554 kB]
Tõmba:8 http://ee.archive.ubuntu.com/ubuntu/ trusty-updates/main libgcc-4.8-dev i386 4.8.4-2ubuntu1~14.04 [1 736 kB]
Tõmba:9 http://ee.archive.ubuntu.com/ubuntu/ trusty-updates/main gcc-4.8 i386 4.8.4-2ubuntu1~14.04 [4 748 kB]
Tõmba:10 http://ee.archive.ubuntu.com/ubuntu/ trusty/main gcc i386 4:4.8.2-1ubuntu6 [5 096 B]
Tõmba:11 http://ee.archive.ubuntu.com/ubuntu/ trusty-updates/main libstdc++-4.8-dev i386 4.8.4-2ubuntu1~14.04 [1 058 kB]
Tõmba:12 http://ee.archive.ubuntu.com/ubuntu/ trusty-updates/main g++-4.8 i386 4.8.4-2ubuntu1~14.04 [14,8 MB]
Tõmba:13 http://ee.archive.ubuntu.com/ubuntu/ trusty/main g++ i386 4:4.8.2-1ubuntu6 [1 500 B]
Tõmba:14 http://ee.archive.ubuntu.com/ubuntu/ trusty/main make i386 3.81-8.2ubuntu3 [115 kB]
Tõmba:15 http://ee.archive.ubuntu.com/ubuntu/ trusty-updates/main libdpkg-perl all 1.17.5ubuntu5.4 [179 kB]
Tõmba:16 http://ee.archive.ubuntu.com/ubuntu/ trusty-updates/main dpkg-dev all 1.17.5ubuntu5.4 [726 kB]
Tõmba:17 http://ee.archive.ubuntu.com/ubuntu/ trusty/main build-essential i386 11.6ubuntu6 [4 824 B]
Tõmba:18 http://ee.archive.ubuntu.com/ubuntu/ trusty/main libfakeroot i386 1.20-3ubuntu2 [25,4 kB]
Tõmba:19 http://ee.archive.ubuntu.com/ubuntu/ trusty/main fakeroot i386 1.20-3ubuntu2 [55,4 kB]
Tõmba:20 http://ee.archive.ubuntu.com/ubuntu/ trusty/main liberror-perl all 0.17-1.1 [21,1 kB]
Tõmba:21 http://ee.archive.ubuntu.com/ubuntu/ trusty-updates/main git-man all 1:1.9.1-1ubuntu0.1 [698 kB]
Tõmba:22 http://ee.archive.ubuntu.com/ubuntu/ trusty-updates/main git i386 1:1.9.1-1ubuntu0.1 [2 511 kB]
Tõmba:23 http://ee.archive.ubuntu.com/ubuntu/ trusty/main libalgorithm-diff-perl all 1.19.02-3 [50,0 kB]
Tõmba:24 http://ee.archive.ubuntu.com/ubuntu/ trusty/main libalgorithm-diff-xs-perl i386 0.04-2build4 [13,1 kB]
Tõmba:25 http://ee.archive.ubuntu.com/ubuntu/ trusty/main libalgorithm-merge-perl all 0.08-2 [12,7 kB]
Tõmba:26 http://ee.archive.ubuntu.com/ubuntu/ trusty/main libfile-fcntllock-perl i386 0.14-2build1 [16,0 kB]
Tõmba:27 http://ee.archive.ubuntu.com/ubuntu/ trusty/main manpages-dev all 3.54-1ubuntu1 [1 820 kB]
Tõmba:28 http://ee.archive.ubuntu.com/ubuntu/ trusty-updates/universe python-chardet-whl all 2.2.1-2~ubuntu1 [170 kB]
Tõmba:29 http://ee.archive.ubuntu.com/ubuntu/ trusty-updates/universe python-colorama all 0.2.5-0.1ubuntu2 [18,4 kB]
Tõmba:30 http://ee.archive.ubuntu.com/ubuntu/ trusty-updates/universe python-colorama-whl all 0.2.5-0.1ubuntu2 [18,2 kB]
Tõmba:31 http://ee.archive.ubuntu.com/ubuntu/ trusty/main python-crypto i386 2.6.1-4build1 [234 kB]
Tõmba:32 http://ee.archive.ubuntu.com/ubuntu/ trusty/main python-dateutil all 1.5+dfsg-1ubuntu1 [48,9 kB]
Tõmba:33 http://ee.archive.ubuntu.com/ubuntu/ trusty-updates/universe python-distlib all 0.1.8-1ubuntu1 [113 kB]
Tõmba:34 http://ee.archive.ubuntu.com/ubuntu/ trusty-updates/universe python-distlib-whl all 0.1.8-1ubuntu1 [140 kB]
Tõmba:35 http://ee.archive.ubuntu.com/ubuntu/ trusty/universe python-gflags all 1.5.1-1build1 [39,7 kB]
Tõmba:36 http://ee.archive.ubuntu.com/ubuntu/ trusty-updates/main python-html5lib all 0.999-3~ubuntu1 [83,5 kB]
Tõmba:37 http://ee.archive.ubuntu.com/ubuntu/ trusty-updates/main python-html5lib-whl all 0.999-3~ubuntu1 [109 kB]
Tõmba:38 http://ee.archive.ubuntu.com/ubuntu/ trusty/main python-parsedatetime all 1.1.2-0ubuntu1 [20,5 kB]
Tõmba:39 http://ee.archive.ubuntu.com/ubuntu/ trusty-updates/main python-six-whl all 1.5.2-1ubuntu1 [10,5 kB]
Tõmba:40 http://ee.archive.ubuntu.com/ubuntu/ trusty-updates/main python-urllib3-whl all 1.7.1-1ubuntu3 [64,0 kB]
Tõmba:41 http://ee.archive.ubuntu.com/ubuntu/ trusty-updates/main python-requests-whl all 2.2.1-1ubuntu0.3 [227 kB]
Tõmba:42 http://ee.archive.ubuntu.com/ubuntu/ trusty-updates/main python-setuptools-whl all 3.3-1ubuntu2 [244 kB]
Tõmba:43 http://ee.archive.ubuntu.com/ubuntu/ trusty-updates/universe python-pip-whl all 1.5.4-1ubuntu3 [111 kB]
Tõmba:44 http://ee.archive.ubuntu.com/ubuntu/ trusty-updates/main python-setuptools all 3.3-1ubuntu2 [230 kB]
Tõmba:45 http://ee.archive.ubuntu.com/ubuntu/ trusty-updates/universe python-pip all 1.5.4-1ubuntu3 [97,2 kB]
Tõmba:46 http://ee.archive.ubuntu.com/ubuntu/ trusty/main python-pyicu i386 1.5-2ubuntu4 [146 kB]
Tõmba:47 http://ee.archive.ubuntu.com/ubuntu/ trusty/universe python-vobject all 0.8.1c-4ubuntu1 [47,9 kB]
Tõmba:48 http://ee.archive.ubuntu.com/ubuntu/ trusty-updates/main python-wheel all 0.24.0-1~ubuntu1 [44,7 kB]
Tõmba:49 http://ee.archive.ubuntu.com/ubuntu/ trusty/universe python-gdata all 2.0.18+dfsg-1 [466 kB]
Fetched 35,9 MB in 55s (646 kB/s)
Mallide lahtipakkimine pakettidest: 100%
Selecting previously unselected package libasan0:i386.
(Andmebaasi lugemine ... 178615 files and directories currently installed.)
Preparing to unpack .../libasan0_4.8.4-2ubuntu1~14.04_i386.deb ...
Unpacking libasan0:i386 (4.8.4-2ubuntu1~14.04) ...
Selecting previously unselected package libatomic1:i386.
Preparing to unpack .../libatomic1_4.8.4-2ubuntu1~14.04_i386.deb ...
Unpacking libatomic1:i386 (4.8.4-2ubuntu1~14.04) ...
Selecting previously unselected package libitm1:i386.
Preparing to unpack .../libitm1_4.8.4-2ubuntu1~14.04_i386.deb ...
Unpacking libitm1:i386 (4.8.4-2ubuntu1~14.04) ...
Selecting previously unselected package binutils.
Preparing to unpack .../binutils_2.24-5ubuntu14_i386.deb ...
Unpacking binutils (2.24-5ubuntu14) ...
Selecting previously unselected package libc-dev-bin.
Preparing to unpack .../libc-dev-bin_2.19-0ubuntu6.6_i386.deb ...
Unpacking libc-dev-bin (2.19-0ubuntu6.6) ...
Selecting previously unselected package linux-libc-dev:i386.
Preparing to unpack .../linux-libc-dev_3.13.0-65.105_i386.deb ...
Unpacking linux-libc-dev:i386 (3.13.0-65.105) ...
Selecting previously unselected package libc6-dev:i386.
Preparing to unpack .../libc6-dev_2.19-0ubuntu6.6_i386.deb ...
Unpacking libc6-dev:i386 (2.19-0ubuntu6.6) ...
Selecting previously unselected package libgcc-4.8-dev:i386.
Preparing to unpack .../libgcc-4.8-dev_4.8.4-2ubuntu1~14.04_i386.deb ...
Unpacking libgcc-4.8-dev:i386 (4.8.4-2ubuntu1~14.04) ...
Selecting previously unselected package gcc-4.8.
Preparing to unpack .../gcc-4.8_4.8.4-2ubuntu1~14.04_i386.deb ...
Unpacking gcc-4.8 (4.8.4-2ubuntu1~14.04) ...
Selecting previously unselected package gcc.
Preparing to unpack .../gcc_4%3a4.8.2-1ubuntu6_i386.deb ...
Unpacking gcc (4:4.8.2-1ubuntu6) ...
Selecting previously unselected package libstdc++-4.8-dev:i386.
Preparing to unpack .../libstdc++-4.8-dev_4.8.4-2ubuntu1~14.04_i386.deb ...
Unpacking libstdc++-4.8-dev:i386 (4.8.4-2ubuntu1~14.04) ...
Selecting previously unselected package g++-4.8.
Preparing to unpack .../g++-4.8_4.8.4-2ubuntu1~14.04_i386.deb ...
Unpacking g++-4.8 (4.8.4-2ubuntu1~14.04) ...
Selecting previously unselected package g++.
Preparing to unpack .../g++_4%3a4.8.2-1ubuntu6_i386.deb ...
Unpacking g++ (4:4.8.2-1ubuntu6) ...
Selecting previously unselected package make.
Preparing to unpack .../make_3.81-8.2ubuntu3_i386.deb ...
Unpacking make (3.81-8.2ubuntu3) ...
Selecting previously unselected package libdpkg-perl.
Preparing to unpack .../libdpkg-perl_1.17.5ubuntu5.4_all.deb ...
Unpacking libdpkg-perl (1.17.5ubuntu5.4) ...
Selecting previously unselected package dpkg-dev.
Preparing to unpack .../dpkg-dev_1.17.5ubuntu5.4_all.deb ...
Unpacking dpkg-dev (1.17.5ubuntu5.4) ...
Selecting previously unselected package build-essential.
Preparing to unpack .../build-essential_11.6ubuntu6_i386.deb ...
Unpacking build-essential (11.6ubuntu6) ...
Selecting previously unselected package libfakeroot:i386.
Preparing to unpack .../libfakeroot_1.20-3ubuntu2_i386.deb ...
Unpacking libfakeroot:i386 (1.20-3ubuntu2) ...
Selecting previously unselected package fakeroot.
Preparing to unpack .../fakeroot_1.20-3ubuntu2_i386.deb ...
Unpacking fakeroot (1.20-3ubuntu2) ...
Selecting previously unselected package liberror-perl.
Preparing to unpack .../liberror-perl_0.17-1.1_all.deb ...
Unpacking liberror-perl (0.17-1.1) ...
Selecting previously unselected package git-man.
Preparing to unpack .../git-man_1%3a1.9.1-1ubuntu0.1_all.deb ...
Unpacking git-man (1:1.9.1-1ubuntu0.1) ...
Selecting previously unselected package git.
Preparing to unpack .../git_1%3a1.9.1-1ubuntu0.1_i386.deb ...
Unpacking git (1:1.9.1-1ubuntu0.1) ...
Selecting previously unselected package libalgorithm-diff-perl.
Preparing to unpack .../libalgorithm-diff-perl_1.19.02-3_all.deb ...
Unpacking libalgorithm-diff-perl (1.19.02-3) ...
Selecting previously unselected package libalgorithm-diff-xs-perl.
Preparing to unpack .../libalgorithm-diff-xs-perl_0.04-2build4_i386.deb ...
Unpacking libalgorithm-diff-xs-perl (0.04-2build4) ...
Selecting previously unselected package libalgorithm-merge-perl.
Preparing to unpack .../libalgorithm-merge-perl_0.08-2_all.deb ...
Unpacking libalgorithm-merge-perl (0.08-2) ...
Selecting previously unselected package libfile-fcntllock-perl.
Preparing to unpack .../libfile-fcntllock-perl_0.14-2build1_i386.deb ...
Unpacking libfile-fcntllock-perl (0.14-2build1) ...
Selecting previously unselected package manpages-dev.
Preparing to unpack .../manpages-dev_3.54-1ubuntu1_all.deb ...
Unpacking manpages-dev (3.54-1ubuntu1) ...
Selecting previously unselected package python-chardet-whl.
Preparing to unpack .../python-chardet-whl_2.2.1-2~ubuntu1_all.deb ...
Unpacking python-chardet-whl (2.2.1-2~ubuntu1) ...
Selecting previously unselected package python-colorama.
Preparing to unpack .../python-colorama_0.2.5-0.1ubuntu2_all.deb ...
Unpacking python-colorama (0.2.5-0.1ubuntu2) ...
Selecting previously unselected package python-colorama-whl.
Preparing to unpack .../python-colorama-whl_0.2.5-0.1ubuntu2_all.deb ...
Unpacking python-colorama-whl (0.2.5-0.1ubuntu2) ...
Selecting previously unselected package python-crypto.
Preparing to unpack .../python-crypto_2.6.1-4build1_i386.deb ...
Unpacking python-crypto (2.6.1-4build1) ...
Selecting previously unselected package python-dateutil.
Preparing to unpack .../python-dateutil_1.5+dfsg-1ubuntu1_all.deb ...
Unpacking python-dateutil (1.5+dfsg-1ubuntu1) ...
Selecting previously unselected package python-distlib.
Preparing to unpack .../python-distlib_0.1.8-1ubuntu1_all.deb ...
Unpacking python-distlib (0.1.8-1ubuntu1) ...
Selecting previously unselected package python-distlib-whl.
Preparing to unpack .../python-distlib-whl_0.1.8-1ubuntu1_all.deb ...
Unpacking python-distlib-whl (0.1.8-1ubuntu1) ...
Selecting previously unselected package python-gflags.
Preparing to unpack .../python-gflags_1.5.1-1build1_all.deb ...
Unpacking python-gflags (1.5.1-1build1) ...
Selecting previously unselected package python-html5lib.
Preparing to unpack .../python-html5lib_0.999-3~ubuntu1_all.deb ...
Unpacking python-html5lib (0.999-3~ubuntu1) ...
Selecting previously unselected package python-html5lib-whl.
Preparing to unpack .../python-html5lib-whl_0.999-3~ubuntu1_all.deb ...
Unpacking python-html5lib-whl (0.999-3~ubuntu1) ...
Selecting previously unselected package python-parsedatetime.
Preparing to unpack .../python-parsedatetime_1.1.2-0ubuntu1_all.deb ...
Unpacking python-parsedatetime (1.1.2-0ubuntu1) ...
Selecting previously unselected package python-six-whl.
Preparing to unpack .../python-six-whl_1.5.2-1ubuntu1_all.deb ...
Unpacking python-six-whl (1.5.2-1ubuntu1) ...
Selecting previously unselected package python-urllib3-whl.
Preparing to unpack .../python-urllib3-whl_1.7.1-1ubuntu3_all.deb ...
Unpacking python-urllib3-whl (1.7.1-1ubuntu3) ...
Selecting previously unselected package python-requests-whl.
Preparing to unpack .../python-requests-whl_2.2.1-1ubuntu0.3_all.deb ...
Unpacking python-requests-whl (2.2.1-1ubuntu0.3) ...
Selecting previously unselected package python-setuptools-whl.
Preparing to unpack .../python-setuptools-whl_3.3-1ubuntu2_all.deb ...
Unpacking python-setuptools-whl (3.3-1ubuntu2) ...
Selecting previously unselected package python-pip-whl.
Preparing to unpack .../python-pip-whl_1.5.4-1ubuntu3_all.deb ...
Unpacking python-pip-whl (1.5.4-1ubuntu3) ...
Selecting previously unselected package python-setuptools.
Preparing to unpack .../python-setuptools_3.3-1ubuntu2_all.deb ...
Unpacking python-setuptools (3.3-1ubuntu2) ...
Selecting previously unselected package python-pip.
Preparing to unpack .../python-pip_1.5.4-1ubuntu3_all.deb ...
Unpacking python-pip (1.5.4-1ubuntu3) ...
Selecting previously unselected package python-pyicu.
Preparing to unpack .../python-pyicu_1.5-2ubuntu4_i386.deb ...
Unpacking python-pyicu (1.5-2ubuntu4) ...
Selecting previously unselected package python-vobject.
Preparing to unpack .../python-vobject_0.8.1c-4ubuntu1_all.deb ...
Unpacking python-vobject (0.8.1c-4ubuntu1) ...
Selecting previously unselected package python-wheel.
Preparing to unpack .../python-wheel_0.24.0-1~ubuntu1_all.deb ...
Unpacking python-wheel (0.24.0-1~ubuntu1) ...
Selecting previously unselected package python-gdata.
Preparing to unpack .../python-gdata_2.0.18+dfsg-1_all.deb ...
Unpacking python-gdata (2.0.18+dfsg-1) ...
Processing triggers for man-db (2.6.7.1-1ubuntu1) ...
Paki libasan0:i386 (4.8.4-2ubuntu1~14.04) paikasättimine ...
Paki libatomic1:i386 (4.8.4-2ubuntu1~14.04) paikasättimine ...
Paki libitm1:i386 (4.8.4-2ubuntu1~14.04) paikasättimine ...
Paki binutils (2.24-5ubuntu14) paikasättimine ...
Paki libc-dev-bin (2.19-0ubuntu6.6) paikasättimine ...
Paki linux-libc-dev:i386 (3.13.0-65.105) paikasättimine ...
Paki libc6-dev:i386 (2.19-0ubuntu6.6) paikasättimine ...
Paki libgcc-4.8-dev:i386 (4.8.4-2ubuntu1~14.04) paikasättimine ...
Paki gcc-4.8 (4.8.4-2ubuntu1~14.04) paikasättimine ...
Paki gcc (4:4.8.2-1ubuntu6) paikasättimine ...
Paki libstdc++-4.8-dev:i386 (4.8.4-2ubuntu1~14.04) paikasättimine ...
Paki g++-4.8 (4.8.4-2ubuntu1~14.04) paikasättimine ...
Paki g++ (4:4.8.2-1ubuntu6) paikasättimine ...
update-alternatives: using /usr/bin/g++ to provide /usr/bin/c++ (c++) in automaatrežiim
Paki make (3.81-8.2ubuntu3) paikasättimine ...
Paki libdpkg-perl (1.17.5ubuntu5.4) paikasättimine ...
Paki dpkg-dev (1.17.5ubuntu5.4) paikasättimine ...
Paki build-essential (11.6ubuntu6) paikasättimine ...
Paki libfakeroot:i386 (1.20-3ubuntu2) paikasättimine ...
Paki fakeroot (1.20-3ubuntu2) paikasättimine ...
update-alternatives: using /usr/bin/fakeroot-sysv to provide /usr/bin/fakeroot (fakeroot) in automaatrežiim
Paki liberror-perl (0.17-1.1) paikasättimine ...
Paki git-man (1:1.9.1-1ubuntu0.1) paikasättimine ...
Paki git (1:1.9.1-1ubuntu0.1) paikasättimine ...
Paki libalgorithm-diff-perl (1.19.02-3) paikasättimine ...
Paki libalgorithm-diff-xs-perl (0.04-2build4) paikasättimine ...
Paki libalgorithm-merge-perl (0.08-2) paikasättimine ...
Paki libfile-fcntllock-perl (0.14-2build1) paikasättimine ...
Paki manpages-dev (3.54-1ubuntu1) paikasättimine ...
Paki python-chardet-whl (2.2.1-2~ubuntu1) paikasättimine ...
Paki python-colorama (0.2.5-0.1ubuntu2) paikasättimine ...
Paki python-colorama-whl (0.2.5-0.1ubuntu2) paikasättimine ...
Paki python-crypto (2.6.1-4build1) paikasättimine ...
Paki python-dateutil (1.5+dfsg-1ubuntu1) paikasättimine ...
Paki python-distlib (0.1.8-1ubuntu1) paikasättimine ...
Paki python-distlib-whl (0.1.8-1ubuntu1) paikasättimine ...
Paki python-gflags (1.5.1-1build1) paikasättimine ...
Paki python-html5lib (0.999-3~ubuntu1) paikasättimine ...
Paki python-html5lib-whl (0.999-3~ubuntu1) paikasättimine ...
Paki python-parsedatetime (1.1.2-0ubuntu1) paikasättimine ...
Paki python-six-whl (1.5.2-1ubuntu1) paikasättimine ...
Paki python-urllib3-whl (1.7.1-1ubuntu3) paikasättimine ...
Paki python-requests-whl (2.2.1-1ubuntu0.3) paikasättimine ...
Paki python-setuptools-whl (3.3-1ubuntu2) paikasättimine ...
Paki python-pip-whl (1.5.4-1ubuntu3) paikasättimine ...
Paki python-setuptools (3.3-1ubuntu2) paikasättimine ...
Paki python-pip (1.5.4-1ubuntu3) paikasättimine ...
Paki python-pyicu (1.5-2ubuntu4) paikasättimine ...
Paki python-vobject (0.8.1c-4ubuntu1) paikasättimine ...
Paki python-wheel (0.24.0-1~ubuntu1) paikasättimine ...
Paki python-gdata (2.0.18+dfsg-1) paikasättimine ...
Processing triggers for libc-bin (2.19-0ubuntu6.6) ...
iffi@R400:~$ sudo pip install google-api-python-client
Downloading/unpacking google-api-python-client
Downloading google_api_python_client-1.4.2-py2.py3-none-any.whl (48kB): 48kB downloaded
Downloading/unpacking httplib2>=0.8 (from google-api-python-client)
Downloading httplib2-0.9.2.tar.gz (205kB): 205kB downloaded
Running setup.py (path:/tmp/pip_build_root/httplib2/setup.py) egg_info for package httplib2
Downloading/unpacking oauth2client>=1.4.6 (from google-api-python-client)
Downloading oauth2client-1.5.1.tar.gz (56kB): 56kB downloaded
Running setup.py (path:/tmp/pip_build_root/oauth2client/setup.py) egg_info for package oauth2client
Downloading/unpacking six>=1.6.1 (from google-api-python-client)
Downloading six-1.9.0-py2.py3-none-any.whl
Downloading/unpacking uritemplate>=0.6 (from google-api-python-client)
Downloading uritemplate-0.6.tar.gz
Running setup.py (path:/tmp/pip_build_root/uritemplate/setup.py) egg_info for package uritemplate
Downloading/unpacking pyasn1>=0.1.7 (from oauth2client>=1.4.6->google-api-python-client)
Downloading pyasn1-0.1.9-py2.py3-none-any.whl
Downloading/unpacking pyasn1-modules>=0.0.5 (from oauth2client>=1.4.6->google-api-python-client)
Downloading pyasn1_modules-0.0.8-py2.py3-none-any.whl
Downloading/unpacking rsa>=3.1.4 (from oauth2client>=1.4.6->google-api-python-client)
Downloading rsa-3.2-py2.py3-none-any.whl (43kB): 43kB downloaded
Downloading/unpacking simplejson>=2.5.0 (from uritemplate>=0.6->google-api-python-client)
Downloading simplejson-3.8.0.tar.gz (75kB): 75kB downloaded
Running setup.py (path:/tmp/pip_build_root/simplejson/setup.py) egg_info for package simplejson
Installing collected packages: google-api-python-client, httplib2, oauth2client, six, uritemplate, pyasn1, pyasn1-modules, rsa, simplejson
Running setup.py install for httplib2
Running setup.py install for oauth2client
Found existing installation: six 1.5.2
Not uninstalling six at /usr/lib/python2.7/dist-packages, owned by OS
Running setup.py install for uritemplate
Running setup.py install for simplejson
building 'simplejson._speedups' extension
i686-linux-gnu-gcc -pthread -fno-strict-aliasing -DNDEBUG -g -fwrapv -O2 -Wall -Wstrict-prototypes -fPIC -I/usr/include/python2.7 -c simplejson/_speedups.c -o build/temp.linux-i686-2.7/simplejson/_speedups.o
simplejson/_speedups.c:2:20: fatal error: Python.h: No such file or directory
#include "Python.h"
^
compilation terminated.
***************************************************************************
WARNING: The C extension could not be compiled, speedups are not enabled.
Failure information, if any, is above.
I'm retrying the build without the C extension now.
***************************************************************************
***************************************************************************
WARNING: The C extension could not be compiled, speedups are not enabled.
Plain-Python installation succeeded.
***************************************************************************
Successfully installed google-api-python-client httplib2 oauth2client six uritemplate pyasn1 pyasn1-modules rsa simplejson
Cleaning up...
iffi@R400:~$ sudo pip install apiclient urllib3
Downloading/unpacking apiclient
Downloading apiclient-1.0.2.tar.gz
Running setup.py (path:/tmp/pip_build_root/apiclient/setup.py) egg_info for package apiclient
Requirement already satisfied (use --upgrade to upgrade): urllib3 in /usr/lib/python2.7/dist-packages
Installing collected packages: apiclient
Running setup.py install for apiclient
Successfully installed apiclient
Cleaning up...
iffi@R400:~$ git clone https://github.com/insanum/gcalcli.git
Cloning into 'gcalcli'...
remote: Counting objects: 901, done.
remote: Total 901 (delta 0), reused 0 (delta 0), pack-reused 901
Receiving objects: 100% (901/901), 2.08 MiB | 827.00 KiB/s, done.
Resolving deltas: 100% (499/499), done.
Checking connectivity... done.
iffi@R400:~$ cd gcalcli
iffi@R400:~/gcalcli$ sudo python setup.py install
running install
running bdist_egg
running egg_info
creating gcalcli.egg-info
writing requirements to gcalcli.egg-info/requires.txt
writing gcalcli.egg-info/PKG-INFO
writing top-level names to gcalcli.egg-info/top_level.txt
writing dependency_links to gcalcli.egg-info/dependency_links.txt
writing manifest file 'gcalcli.egg-info/SOURCES.txt'
reading manifest file 'gcalcli.egg-info/SOURCES.txt'
writing manifest file 'gcalcli.egg-info/SOURCES.txt'
installing library code to build/bdist.linux-i686/egg
running install_lib
warning: install_lib: 'build/lib.linux-i686-2.7' does not exist -- no Python modules to install
creating build
creating build/bdist.linux-i686
creating build/bdist.linux-i686/egg
creating build/bdist.linux-i686/egg/EGG-INFO
installing scripts to build/bdist.linux-i686/egg/EGG-INFO/scripts
running install_scripts
running build_scripts
creating build/scripts-2.7
copying and adjusting gcalcli -> build/scripts-2.7
changing mode of build/scripts-2.7/gcalcli from 644 to 755
creating build/bdist.linux-i686/egg/EGG-INFO/scripts
copying build/scripts-2.7/gcalcli -> build/bdist.linux-i686/egg/EGG-INFO/scripts
changing mode of build/bdist.linux-i686/egg/EGG-INFO/scripts/gcalcli to 755
copying gcalcli.egg-info/PKG-INFO -> build/bdist.linux-i686/egg/EGG-INFO
copying gcalcli.egg-info/SOURCES.txt -> build/bdist.linux-i686/egg/EGG-INFO
copying gcalcli.egg-info/dependency_links.txt -> build/bdist.linux-i686/egg/EGG-INFO
copying gcalcli.egg-info/requires.txt -> build/bdist.linux-i686/egg/EGG-INFO
copying gcalcli.egg-info/top_level.txt -> build/bdist.linux-i686/egg/EGG-INFO
zip_safe flag not set; analyzing archive contents...
creating dist
creating 'dist/gcalcli-3.3.2-py2.7.egg' and adding 'build/bdist.linux-i686/egg' to it
removing 'build/bdist.linux-i686/egg' (and everything under it)
Processing gcalcli-3.3.2-py2.7.egg
Copying gcalcli-3.3.2-py2.7.egg to /usr/local/lib/python2.7/dist-packages
Adding gcalcli 3.3.2 to easy-install.pth file
Installing gcalcli script to /usr/local/bin
Installed /usr/local/lib/python2.7/dist-packages/gcalcli-3.3.2-py2.7.egg
Processing dependencies for gcalcli==3.3.2
Searching for oauth2client<=1.4.12
Reading https://pypi.python.org/simple/oauth2client/
Reading http://code.google.com/p/google-api-python-client/
Reading http://github.com/google/oauth2client/
Best match: oauth2client 1.4.12
Downloading https://pypi.python.org/packages/2.7/o/oauth2client/oauth2client-1.4.12-py2.7.egg#md5=8265f6985905a5590c622741980a47e5
Processing oauth2client-1.4.12-py2.7.egg
Moving oauth2client-1.4.12-py2.7.egg to /usr/local/lib/python2.7/dist-packages
Adding oauth2client 1.4.12 to easy-install.pth file
Installed /usr/local/lib/python2.7/dist-packages/oauth2client-1.4.12-py2.7.egg
Searching for google-api-python-client==1.4.2
Best match: google-api-python-client 1.4.2
Adding google-api-python-client 1.4.2 to easy-install.pth file
Using /usr/local/lib/python2.7/dist-packages
Searching for httplib2==0.9.2
Best match: httplib2 0.9.2
Adding httplib2 0.9.2 to easy-install.pth file
Using /usr/local/lib/python2.7/dist-packages
Searching for python-gflags==1.5.1
Best match: python-gflags 1.5.1
Adding python-gflags 1.5.1 to easy-install.pth file
Using /usr/lib/python2.7/dist-packages
Searching for python-dateutil==1.5
Best match: python-dateutil 1.5
python-dateutil 1.5 is already the active version in easy-install.pth
Using /usr/lib/python2.7/dist-packages
Searching for six==1.9.0
Best match: six 1.9.0
Adding six 1.9.0 to easy-install.pth file
Using /usr/local/lib/python2.7/dist-packages
Searching for rsa==3.2
Best match: rsa 3.2
Adding rsa 3.2 to easy-install.pth file
Installing pyrsa-encrypt-bigfile script to /usr/local/bin
Installing pyrsa-encrypt script to /usr/local/bin
Installing pyrsa-verify script to /usr/local/bin
Installing pyrsa-sign script to /usr/local/bin
Installing pyrsa-priv2pub script to /usr/local/bin
Installing pyrsa-decrypt script to /usr/local/bin
Installing pyrsa-decrypt-bigfile script to /usr/local/bin
Installing pyrsa-keygen script to /usr/local/bin
Using /usr/local/lib/python2.7/dist-packages
Searching for pyasn1-modules==0.0.8
Best match: pyasn1-modules 0.0.8
Adding pyasn1-modules 0.0.8 to easy-install.pth file
Using /usr/local/lib/python2.7/dist-packages
Searching for pyasn1==0.1.9
Best match: pyasn1 0.1.9
Adding pyasn1 0.1.9 to easy-install.pth file
Using /usr/local/lib/python2.7/dist-packages
Searching for uritemplate==0.6
Best match: uritemplate 0.6
Adding uritemplate 0.6 to easy-install.pth file
Using /usr/local/lib/python2.7/dist-packages
Searching for simplejson==3.8.0
Best match: simplejson 3.8.0
Adding simplejson 3.8.0 to easy-install.pth file
Using /usr/local/lib/python2.7/dist-packages
Finished processing dependencies for gcalcli==3.3.2
iffi@R400:~/gcalcli$ gcalcli agenda
ERROR: Missing module - No module named discovery
iffi@R400:~/gcalcli$ gcalcli agenda
ERROR: Missing module - No module named discovery
iffi@R400:~/gcalcli$ sudo su
root@R400:/home/iffi/gcalcli# gcalcli agenda
ERROR: Missing module - No module named discovery
root@R400:/home/iffi/gcalcli# gcalcli
ERROR: Missing module - No module named discovery
root@R400:/home/iffi/gcalcli# gcalcli agenda
ERROR: Missing module - No module named discovery
root@R400:/home/iffi/gcalcli# gcalcli agenda
ERROR: Missing module - No module named discovery
root@R400:/home/iffi/gcalcli# sudo python setup.py install
running install
running bdist_egg
running egg_info
writing requirements to gcalcli.egg-info/requires.txt
writing gcalcli.egg-info/PKG-INFO
writing top-level names to gcalcli.egg-info/top_level.txt
writing dependency_links to gcalcli.egg-info/dependency_links.txt
reading manifest file 'gcalcli.egg-info/SOURCES.txt'
writing manifest file 'gcalcli.egg-info/SOURCES.txt'
installing library code to build/bdist.linux-i686/egg
running install_lib
warning: install_lib: 'build/lib.linux-i686-2.7' does not exist -- no Python modules to install
creating build/bdist.linux-i686/egg
creating build/bdist.linux-i686/egg/EGG-INFO
installing scripts to build/bdist.linux-i686/egg/EGG-INFO/scripts
running install_scripts
running build_scripts
creating build/bdist.linux-i686/egg/EGG-INFO/scripts
copying build/scripts-2.7/gcalcli -> build/bdist.linux-i686/egg/EGG-INFO/scripts
changing mode of build/bdist.linux-i686/egg/EGG-INFO/scripts/gcalcli to 755
copying gcalcli.egg-info/PKG-INFO -> build/bdist.linux-i686/egg/EGG-INFO
copying gcalcli.egg-info/SOURCES.txt -> build/bdist.linux-i686/egg/EGG-INFO
copying gcalcli.egg-info/dependency_links.txt -> build/bdist.linux-i686/egg/EGG-INFO
copying gcalcli.egg-info/requires.txt -> build/bdist.linux-i686/egg/EGG-INFO
copying gcalcli.egg-info/top_level.txt -> build/bdist.linux-i686/egg/EGG-INFO
zip_safe flag not set; analyzing archive contents...
creating 'dist/gcalcli-3.3.2-py2.7.egg' and adding 'build/bdist.linux-i686/egg' to it
removing 'build/bdist.linux-i686/egg' (and everything under it)
Processing gcalcli-3.3.2-py2.7.egg
Removing /usr/local/lib/python2.7/dist-packages/gcalcli-3.3.2-py2.7.egg
Copying gcalcli-3.3.2-py2.7.egg to /usr/local/lib/python2.7/dist-packages
gcalcli 3.3.2 is already the active version in easy-install.pth
Installing gcalcli script to /usr/local/bin
Installed /usr/local/lib/python2.7/dist-packages/gcalcli-3.3.2-py2.7.egg
Processing dependencies for gcalcli==3.3.2
Searching for oauth2client==1.4.12
Best match: oauth2client 1.4.12
Processing oauth2client-1.4.12-py2.7.egg
oauth2client 1.4.12 is already the active version in easy-install.pth
Using /usr/local/lib/python2.7/dist-packages/oauth2client-1.4.12-py2.7.egg
Searching for google-api-python-client==1.4.2
Best match: google-api-python-client 1.4.2
Adding google-api-python-client 1.4.2 to easy-install.pth file
Using /usr/local/lib/python2.7/dist-packages
Searching for httplib2==0.9.2
Best match: httplib2 0.9.2
Adding httplib2 0.9.2 to easy-install.pth file
Using /usr/local/lib/python2.7/dist-packages
Searching for python-gflags==1.5.1
Best match: python-gflags 1.5.1
python-gflags 1.5.1 is already the active version in easy-install.pth
Using /usr/lib/python2.7/dist-packages
Searching for python-dateutil==1.5
Best match: python-dateutil 1.5
python-dateutil 1.5 is already the active version in easy-install.pth
Using /usr/lib/python2.7/dist-packages
Searching for six==1.9.0
Best match: six 1.9.0
Removing six 1.5.2 from easy-install.pth file
Adding six 1.9.0 to easy-install.pth file
Using /usr/local/lib/python2.7/dist-packages
Searching for rsa==3.2
Best match: rsa 3.2
Adding rsa 3.2 to easy-install.pth file
Installing pyrsa-encrypt-bigfile script to /usr/local/bin
Installing pyrsa-encrypt script to /usr/local/bin
Installing pyrsa-verify script to /usr/local/bin
Installing pyrsa-sign script to /usr/local/bin
Installing pyrsa-priv2pub script to /usr/local/bin
Installing pyrsa-decrypt script to /usr/local/bin
Installing pyrsa-decrypt-bigfile script to /usr/local/bin
Installing pyrsa-keygen script to /usr/local/bin
Using /usr/local/lib/python2.7/dist-packages
Searching for pyasn1-modules==0.0.8
Best match: pyasn1-modules 0.0.8
Adding pyasn1-modules 0.0.8 to easy-install.pth file
Using /usr/local/lib/python2.7/dist-packages
Searching for pyasn1==0.1.9
Best match: pyasn1 0.1.9
Adding pyasn1 0.1.9 to easy-install.pth file
Using /usr/local/lib/python2.7/dist-packages
Searching for uritemplate==0.6
Best match: uritemplate 0.6
Adding uritemplate 0.6 to easy-install.pth file
Using /usr/local/lib/python2.7/dist-packages
Searching for simplejson==3.8.0
Best match: simplejson 3.8.0
Adding simplejson 3.8.0 to easy-install.pth file
Using /usr/local/lib/python2.7/dist-packages
Finished processing dependencies for gcalcli==3.3.2
root@R400:/home/iffi/gcalcli# gcalcli agenda
ERROR: Missing module - No module named discovery
root@R400:/home/iffi/gcalcli# sudo pip install --upgrade google-api-python-client
Requirement already up-to-date: google-api-python-client in /usr/local/lib/python2.7/dist-packages
Cleaning up...
root@R400:/home/iffi/gcalcli# gcalcli agenda
ERROR: Missing module - No module named discovery
root@R400:/home/iffi/gcalcli# sudo python setup.py install
running install
running bdist_egg
running egg_info
writing requirements to gcalcli.egg-info/requires.txt
writing gcalcli.egg-info/PKG-INFO
writing top-level names to gcalcli.egg-info/top_level.txt
writing dependency_links to gcalcli.egg-info/dependency_links.txt
reading manifest file 'gcalcli.egg-info/SOURCES.txt'
writing manifest file 'gcalcli.egg-info/SOURCES.txt'
installing library code to build/bdist.linux-i686/egg
running install_lib
warning: install_lib: 'build/lib.linux-i686-2.7' does not exist -- no Python modules to install
creating build/bdist.linux-i686/egg
creating build/bdist.linux-i686/egg/EGG-INFO
installing scripts to build/bdist.linux-i686/egg/EGG-INFO/scripts
running install_scripts
running build_scripts
creating build/bdist.linux-i686/egg/EGG-INFO/scripts
copying build/scripts-2.7/gcalcli -> build/bdist.linux-i686/egg/EGG-INFO/scripts
changing mode of build/bdist.linux-i686/egg/EGG-INFO/scripts/gcalcli to 755
copying gcalcli.egg-info/PKG-INFO -> build/bdist.linux-i686/egg/EGG-INFO
copying gcalcli.egg-info/SOURCES.txt -> build/bdist.linux-i686/egg/EGG-INFO
copying gcalcli.egg-info/dependency_links.txt -> build/bdist.linux-i686/egg/EGG-INFO
copying gcalcli.egg-info/requires.txt -> build/bdist.linux-i686/egg/EGG-INFO
copying gcalcli.egg-info/top_level.txt -> build/bdist.linux-i686/egg/EGG-INFO
zip_safe flag not set; analyzing archive contents...
creating 'dist/gcalcli-3.3.2-py2.7.egg' and adding 'build/bdist.linux-i686/egg' to it
removing 'build/bdist.linux-i686/egg' (and everything under it)
Processing gcalcli-3.3.2-py2.7.egg
Removing /usr/local/lib/python2.7/dist-packages/gcalcli-3.3.2-py2.7.egg
Copying gcalcli-3.3.2-py2.7.egg to /usr/local/lib/python2.7/dist-packages
gcalcli 3.3.2 is already the active version in easy-install.pth
Installing gcalcli script to /usr/local/bin
Installed /usr/local/lib/python2.7/dist-packages/gcalcli-3.3.2-py2.7.egg
Processing dependencies for gcalcli==3.3.2
Searching for oauth2client==1.4.12
Best match: oauth2client 1.4.12
Processing oauth2client-1.4.12-py2.7.egg
oauth2client 1.4.12 is already the active version in easy-install.pth
Using /usr/local/lib/python2.7/dist-packages/oauth2client-1.4.12-py2.7.egg
Searching for google-api-python-client==1.4.2
Best match: google-api-python-client 1.4.2
Adding google-api-python-client 1.4.2 to easy-install.pth file
Using /usr/local/lib/python2.7/dist-packages
Searching for httplib2==0.9.2
Best match: httplib2 0.9.2
Adding httplib2 0.9.2 to easy-install.pth file
Using /usr/local/lib/python2.7/dist-packages
Searching for python-gflags==1.5.1
Best match: python-gflags 1.5.1
Adding python-gflags 1.5.1 to easy-install.pth file
Using /usr/lib/python2.7/dist-packages
Searching for python-dateutil==1.5
Best match: python-dateutil 1.5
python-dateutil 1.5 is already the active version in easy-install.pth
Using /usr/lib/python2.7/dist-packages
Searching for six==1.9.0
Best match: six 1.9.0
Adding six 1.9.0 to easy-install.pth file
Using /usr/local/lib/python2.7/dist-packages
Searching for rsa==3.2
Best match: rsa 3.2
Adding rsa 3.2 to easy-install.pth file
Installing pyrsa-encrypt-bigfile script to /usr/local/bin
Installing pyrsa-encrypt script to /usr/local/bin
Installing pyrsa-verify script to /usr/local/bin
Installing pyrsa-sign script to /usr/local/bin
Installing pyrsa-priv2pub script to /usr/local/bin
Installing pyrsa-decrypt script to /usr/local/bin
Installing pyrsa-decrypt-bigfile script to /usr/local/bin
Installing pyrsa-keygen script to /usr/local/bin
Using /usr/local/lib/python2.7/dist-packages
Searching for pyasn1-modules==0.0.8
Best match: pyasn1-modules 0.0.8
Adding pyasn1-modules 0.0.8 to easy-install.pth file
Using /usr/local/lib/python2.7/dist-packages
Searching for pyasn1==0.1.9
Best match: pyasn1 0.1.9
Adding pyasn1 0.1.9 to easy-install.pth file
Using /usr/local/lib/python2.7/dist-packages
Searching for uritemplate==0.6
Best match: uritemplate 0.6
Adding uritemplate 0.6 to easy-install.pth file
Using /usr/local/lib/python2.7/dist-packages
Searching for simplejson==3.8.0
Best match: simplejson 3.8.0
Adding simplejson 3.8.0 to easy-install.pth file
Using /usr/local/lib/python2.7/dist-packages
Finished processing dependencies for gcalcli==3.3.2
root@R400:/home/iffi/gcalcli# gcalcli agenda
ERROR: Missing module - No module named discovery
root@R400:/home/iffi/gcalcli# pip install discovery
Downloading/unpacking discovery
Downloading discovery-0.0.4.tar.gz
Running setup.py (path:/tmp/pip_build_root/discovery/setup.py) egg_info for package discovery
Downloading/unpacking requests==2.5.0 (from discovery)
Downloading requests-2.5.0-py2.py3-none-any.whl (464kB): 464kB downloaded
Installing collected packages: discovery, requests
Running setup.py install for discovery
Found existing installation: requests 2.2.1
Not uninstalling requests at /usr/lib/python2.7/dist-packages, owned by OS
Successfully installed discovery requests
Cleaning up...
root@R400:/home/iffi/gcalcli# gcalcli agenda
ERROR: Missing module - No module named discovery
root@R400:/home/iffi/gcalcli# pip install --upgrade google-api-python-client
Requirement already up-to-date: google-api-python-client in /usr/local/lib/python2.7/dist-packages
Cleaning up...
root@R400:/home/iffi/gcalcli# easy_install --upgrade google-api-python-client
Searching for google-api-python-client
Reading https://pypi.python.org/simple/google-api-python-client/
Reading http://code.google.com/p/google-api-python-client/
Reading http://github.com/google/google-api-python-client/
Best match: google-api-python-client 1.4.2
Downloading https://pypi.python.org/packages/source/g/google-api-python-client/google-api-python-client-1.4.2.zip#md5=888dc1e75b7dd34739c8187739bf7955
Processing google-api-python-client-1.4.2.zip
Writing /tmp/easy_install-rs10jQ/google-api-python-client-1.4.2/setup.cfg
Running google-api-python-client-1.4.2/setup.py -q bdist_egg --dist-dir /tmp/easy_install-rs10jQ/google-api-python-client-1.4.2/egg-dist-tmp-nkm37f
warning: no files found matching '*.json' under directory 'apiclient'
warning: no files found matching 'README'
warning: no files found matching 'FAQ'
warning: no files found matching 'setpath.sh'
zip_safe flag not set; analyzing archive contents...
Adding google-api-python-client 1.4.2 to easy-install.pth file
Installed /usr/local/lib/python2.7/dist-packages/google_api_python_client-1.4.2-py2.7.egg
Processing dependencies for google-api-python-client
Finished processing dependencies for google-api-python-client
root@R400:/home/iffi/gcalcli# gcalcli agenda
Traceback (most recent call last):
File "/usr/local/bin/gcalcli", line 5, in <module>
pkg_resources.run_script('gcalcli==3.3.2', 'gcalcli')
File "/usr/lib/python2.7/dist-packages/pkg_resources.py", line 528, in run_script
self.require(requires)[0].run_script(script_name, ns)
File "/usr/lib/python2.7/dist-packages/pkg_resources.py", line 1401, in run_script
exec(script_code, namespace, namespace)
File "/usr/local/lib/python2.7/dist-packages/gcalcli-3.3.2-py2.7.egg/EGG-INFO/scripts/gcalcli", line 520, in <module>
File "/usr/local/lib/python2.7/dist-packages/gcalcli-3.3.2-py2.7.egg/EGG-INFO/scripts/gcalcli", line 533, in gcalcli
File "/usr/local/lib/python2.7/dist-packages/gcalcli-3.3.2-py2.7.egg/EGG-INFO/scripts/gcalcli", line 442, in __init__
File "/usr/lib/python2.7/dist-packages/parsedatetime/__init__.py", line 216, in __init__
self.ptc = Constants()
File "/usr/lib/python2.7/dist-packages/parsedatetime/__init__.py", line 1733, in __init__
self.locale = pdtLocales['icu'](self.localeID)
File "/usr/lib/python2.7/dist-packages/parsedatetime/pdt_locales.py", line 151, in __init__
self.icu = pyicu.Locale(localeID)
icu.InvalidArgsError: (<type 'icu.Locale'>, '__init__', (None,))
root@R400:/home/iffi/gcalcli# sudo python setup.py install
running install
running bdist_egg
running egg_info
writing requirements to gcalcli.egg-info/requires.txt
writing gcalcli.egg-info/PKG-INFO
writing top-level names to gcalcli.egg-info/top_level.txt
writing dependency_links to gcalcli.egg-info/dependency_links.txt
reading manifest file 'gcalcli.egg-info/SOURCES.txt'
writing manifest file 'gcalcli.egg-info/SOURCES.txt'
installing library code to build/bdist.linux-i686/egg
running install_lib
warning: install_lib: 'build/lib.linux-i686-2.7' does not exist -- no Python modules to install
creating build/bdist.linux-i686/egg
creating build/bdist.linux-i686/egg/EGG-INFO
installing scripts to build/bdist.linux-i686/egg/EGG-INFO/scripts
running install_scripts
running build_scripts
creating build/bdist.linux-i686/egg/EGG-INFO/scripts
copying build/scripts-2.7/gcalcli -> build/bdist.linux-i686/egg/EGG-INFO/scripts
changing mode of build/bdist.linux-i686/egg/EGG-INFO/scripts/gcalcli to 755
copying gcalcli.egg-info/PKG-INFO -> build/bdist.linux-i686/egg/EGG-INFO
copying gcalcli.egg-info/SOURCES.txt -> build/bdist.linux-i686/egg/EGG-INFO
copying gcalcli.egg-info/dependency_links.txt -> build/bdist.linux-i686/egg/EGG-INFO
copying gcalcli.egg-info/requires.txt -> build/bdist.linux-i686/egg/EGG-INFO
copying gcalcli.egg-info/top_level.txt -> build/bdist.linux-i686/egg/EGG-INFO
zip_safe flag not set; analyzing archive contents...
creating 'dist/gcalcli-3.3.2-py2.7.egg' and adding 'build/bdist.linux-i686/egg' to it
removing 'build/bdist.linux-i686/egg' (and everything under it)
Processing gcalcli-3.3.2-py2.7.egg
Removing /usr/local/lib/python2.7/dist-packages/gcalcli-3.3.2-py2.7.egg
Copying gcalcli-3.3.2-py2.7.egg to /usr/local/lib/python2.7/dist-packages
gcalcli 3.3.2 is already the active version in easy-install.pth
Installing gcalcli script to /usr/local/bin
Installed /usr/local/lib/python2.7/dist-packages/gcalcli-3.3.2-py2.7.egg
Processing dependencies for gcalcli==3.3.2
Searching for oauth2client==1.4.12
Best match: oauth2client 1.4.12
Processing oauth2client-1.4.12-py2.7.egg
oauth2client 1.4.12 is already the active version in easy-install.pth
Using /usr/local/lib/python2.7/dist-packages/oauth2client-1.4.12-py2.7.egg
Searching for google-api-python-client==1.4.2
Best match: google-api-python-client 1.4.2
Processing google_api_python_client-1.4.2-py2.7.egg
google-api-python-client 1.4.2 is already the active version in easy-install.pth
Using /usr/local/lib/python2.7/dist-packages/google_api_python_client-1.4.2-py2.7.egg
Searching for httplib2==0.9.2
Best match: httplib2 0.9.2
Adding httplib2 0.9.2 to easy-install.pth file
Using /usr/local/lib/python2.7/dist-packages
Searching for python-gflags==1.5.1
Best match: python-gflags 1.5.1
python-gflags 1.5.1 is already the active version in easy-install.pth
Using /usr/lib/python2.7/dist-packages
Searching for python-dateutil==1.5
Best match: python-dateutil 1.5
python-dateutil 1.5 is already the active version in easy-install.pth
Using /usr/lib/python2.7/dist-packages
Searching for six==1.9.0
Best match: six 1.9.0
Removing six 1.5.2 from easy-install.pth file
Adding six 1.9.0 to easy-install.pth file
Using /usr/local/lib/python2.7/dist-packages
Searching for rsa==3.2
Best match: rsa 3.2
Adding rsa 3.2 to easy-install.pth file
Installing pyrsa-encrypt-bigfile script to /usr/local/bin
Installing pyrsa-encrypt script to /usr/local/bin
Installing pyrsa-verify script to /usr/local/bin
Installing pyrsa-sign script to /usr/local/bin
Installing pyrsa-priv2pub script to /usr/local/bin
Installing pyrsa-decrypt script to /usr/local/bin
Installing pyrsa-decrypt-bigfile script to /usr/local/bin
Installing pyrsa-keygen script to /usr/local/bin
Using /usr/local/lib/python2.7/dist-packages
Searching for pyasn1-modules==0.0.8
Best match: pyasn1-modules 0.0.8
Adding pyasn1-modules 0.0.8 to easy-install.pth file
Using /usr/local/lib/python2.7/dist-packages
Searching for pyasn1==0.1.9
Best match: pyasn1 0.1.9
Adding pyasn1 0.1.9 to easy-install.pth file
Using /usr/local/lib/python2.7/dist-packages
Searching for uritemplate==0.6
Best match: uritemplate 0.6
Adding uritemplate 0.6 to easy-install.pth file
Using /usr/local/lib/python2.7/dist-packages
Searching for simplejson==3.8.0
Best match: simplejson 3.8.0
Adding simplejson 3.8.0 to easy-install.pth file
Using /usr/local/lib/python2.7/dist-packages
Finished processing dependencies for gcalcli==3.3.2
root@R400:/home/iffi/gcalcli# gcalcli agenda
Traceback (most recent call last):
File "/usr/local/bin/gcalcli", line 5, in <module>
pkg_resources.run_script('gcalcli==3.3.2', 'gcalcli')
File "/usr/lib/python2.7/dist-packages/pkg_resources.py", line 528, in run_script
self.require(requires)[0].run_script(script_name, ns)
File "/usr/lib/python2.7/dist-packages/pkg_resources.py", line 1401, in run_script
exec(script_code, namespace, namespace)
File "/usr/local/lib/python2.7/dist-packages/gcalcli-3.3.2-py2.7.egg/EGG-INFO/scripts/gcalcli", line 520, in <module>
File "/usr/local/lib/python2.7/dist-packages/gcalcli-3.3.2-py2.7.egg/EGG-INFO/scripts/gcalcli", line 533, in gcalcli
File "/usr/local/lib/python2.7/dist-packages/gcalcli-3.3.2-py2.7.egg/EGG-INFO/scripts/gcalcli", line 442, in __init__
File "/usr/lib/python2.7/dist-packages/parsedatetime/__init__.py", line 216, in __init__
self.ptc = Constants()
File "/usr/lib/python2.7/dist-packages/parsedatetime/__init__.py", line 1733, in __init__
self.locale = pdtLocales['icu'](self.localeID)
File "/usr/lib/python2.7/dist-packages/parsedatetime/pdt_locales.py", line 151, in __init__
self.icu = pyicu.Locale(localeID)
icu.InvalidArgsError: (<type 'icu.Locale'>, '__init__', (None,))