In file included from ./plugin.h:25,
from plugin_skel.cpp:9:
./mainWidget.h:39: error: expected class-name before '{' token
./mainWidget.h:95: error: `QListViewItem' has not been declared
./mainWidget.h:95: error: ISO C++ forbids declaration of `item' with no type
./mainWidget.h
./mainWidget.h
./mainWidget.h:105: error: `QListViewItem' has not been declared
./mainWidget.h:105: error: ISO C++ forbids declaration of `item' with no type
./mainWidget.h:110: error: `QListViewItem' has not been declared
./mainWidget.h:110: error: ISO C++ forbids declaration of `item' with no type
make[5]: *** [plugin_skel.lo] Error 1
make[5]: *** Waiting for unfinished jobs....
Session management error: Could not open network socket
make[5]: Leaving directory `/var/tmp/portage/kdeaddons-3.5.2-r1/work/kdeaddons-3.5.2/konq-plugins/sidebar/delicious'
make[4]: *** [all-recursive] Error 1
make[4]: Leaving directory `/var/tmp/portage/kdeaddons-3.5.2-r1/work/kdeaddons-3.5.2/konq-plugins/sidebar/delicious'
make[3]: *** [all-recursive] Error 1
make[3]: Leaving directory `/var/tmp/portage/kdeaddons-3.5.2-r1/work/kdeaddons-3.5.2/konq-plugins/sidebar'
make[2]: *** [all-recursive] Error 1
make[2]: Leaving directory `/var/tmp/portage/kdeaddons-3.5.2-r1/work/kdeaddons-3.5.2/konq-plugins'
make[1]: *** [all-recursive] Error 1
make[1]: Leaving directory `/var/tmp/portage/kdeaddons-3.5.2-r1/work/kdeaddons-3.5.2'
make: *** [all] Error 2
!!! ERROR: kde-base/kdeaddons-3.5.2-r1 failed.
Call stack:
ebuild.sh, line 1539: Called dyn_compile
ebuild.sh, line 939: Called src_compile
kdeaddons-3.5.2-r1.ebuild, line 39: Called kde_src_compile
kde.eclass, line 164: Called kde_src_compile 'all'
kde.eclass, line 306: Called kde_src_compile 'myconf' 'configure' 'make'
kde.eclass, line 302: Called die
!!! died running emake, kde_src_compile:make
!!! If you need support, post the topmost build error, and the call stack if relevant.
re-emerge sys-libs/db ei aita,portage puhastamine+emerge --sync ei aita.



